{"text_format":"2","workbook":"xlsx","n_sheets":4,"sheets":["About the tool","Impact Effort Matrix","Priorities Matrix","Challenges "],"not_rendered":{"charts":0,"images":6,"macros":0,"external_links":1,"defined_names":1,"comments":2,"pivot_tables":0},"unopened":[],"bounds":{"document_bytes":16777216,"sheet_cells":100000,"run_cost":"one","rows_first":2000,"rows_last":500,"rows_between":2000,"halvings":0,"cell_chars":16384,"cell_head_chars":4096},"cells_cut":0,"cells_raw":0,"read":"whole","date_system":"1900"}

{"sheet":"About the tool","index":0,"n_rows":18,"n_cols":15,"rows_kept":18,"cut":false,"hidden":false,"merged":[[3,1,3,11],[5,1,5,11],[14,1,14,11],[18,1,18,11],[17,1,17,11],[4,1,4,4],[13,1,13,4],[16,1,16,4],[1,1,2,18]]}
[]
[null,"About the tool "]
[]
[null,"This tool is designed for organizations that have completed a RAI (Responsible Agricultural Investment) and/or Agri CP (Agricultural Client Protection) assessment and are ready to develop their improvement action plan. Since not all recommendations can be implemented at the same time, the tool helps prioritize actions based on their expected impact, implementation effort, strategic importance, and contribution to responsible agricultural practices. The tool is organized into several worksheets. Click on each title to access the corresponding tab.",{"$nulls":12},"Version: August 2026 - Draft version, under development"]
[null,"I Impact effort matrix "]
[null,"Defining an action plan requires prioritizing the gaps. And the first thing is to identify quick wins. This matrix provides an interactive solution to be used during brainstorming sessions when the team meets to develop the action plan. "]
{"$rows_empty":7}
[null,"II Priorities Matrix "]
[null,"This matrix helps identify priorities for action. While some actions may not qualify as quick wins, they can still represent important priorities because they are linked to several factors that should be considered when prioritizing gaps and developing an action plan to improve practices and performance:"]
[]
[null,"III Challenges "]
[null,"The action plan might face challenges. This is to make sure that the champion or the team is aware of the implementation  challenges and knows how to work with those challenges. Also it is a very good way to have a documented reason when the implementation gets slower or stops. "]

{"sheet":"Impact Effort Matrix","index":1,"n_rows":28,"n_cols":15,"rows_kept":28,"cut":false,"hidden":false,"merged":[[0,14,1,14],[16,6,16,7],[0,1,1,11],[3,6,3,7],[3,9,3,10],[16,9,16,10]]}
[null,"IMPACT- EFFORT MATRIX",{"$nulls":11},"About the tool'!A1","Back"]
[]
[]
[null,null,"Tasks","Effort","Impact",null,"Major Projects (High Effort + High Impact)",null,null,"Quick Wins (Low Effort + High Impact)"]
[null,null,"Develop Sustainability Dashboard","High","High",null,"✓",{"$f":"IFERROR(INDEX($C$5:$C$44,SMALL(IF((LEN($C$5:$C$44)<>0)*($D$5:$D$44=\"High\")*($E$5:$E$44=\"High\"),ROW($C$5:$C$44)-ROW($C$4),\"\"),ROW(D5)-ROW($C$4))),\"\")","v":"Develop Sustainability Dashboard"},null,"✓",{"$f":"IFERROR(INDEX($C$5:$C$44,SMALL(IF((LEN($C$5:$C$44)<>0)*($D$5:$D$44=\"Low\")*($E$5:$E$44=\"High\"),ROW($C$5:$C$44)-ROW($C$4),\"\"),ROW(C5)-ROW($C$4))),\"\")","v":"Establish Stakeholder Grievance Mechanism"}]
[null,null,"Establish Stakeholder Grievance Mechanism","Low","High",null,"✓",{"$f":"IFERROR(INDEX($C$5:$C$44,SMALL(IF((LEN($C$5:$C$44)<>0)*($D$5:$D$44=\"High\")*($E$5:$E$44=\"High\"),ROW($C$5:$C$44)-ROW($C$4),\"\"),ROW(D6)-ROW($C$4))),\"\")","v":"Develop Environmental Management Plan"},null,"✓",{"$f":"IFERROR(INDEX($C$5:$C$44,SMALL(IF((LEN($C$5:$C$44)<>0)*($D$5:$D$44=\"Low\")*($E$5:$E$44=\"High\"),ROW($C$5:$C$44)-ROW($C$4),\"\"),ROW(C6)-ROW($C$4))),\"\")","v":"Train Field Officers on RAI Principles / CP Standards"}]
[null,null,"Conduct Climate Risk Assessment","Medium","High",null,"✓",{"$f":"IFERROR(INDEX($C$5:$C$44,SMALL(IF((LEN($C$5:$C$44)<>0)*($D$5:$D$44=\"High\")*($E$5:$E$44=\"High\"),ROW($C$5:$C$44)-ROW($C$4),\"\"),ROW(D7)-ROW($C$4))),\"\")","v":"Implement Product Traceability System"},null,"✓",{"$f":"IFERROR(INDEX($C$5:$C$44,SMALL(IF((LEN($C$5:$C$44)<>0)*($D$5:$D$44=\"Low\")*($E$5:$E$44=\"High\"),ROW($C$5:$C$44)-ROW($C$4),\"\"),ROW(C7)-ROW($C$4))),\"\")","v":"Create Farmer Feedback System"}]
[null,null,"Develop Environmental Management Plan","High","High",null,null,{"$f":"IFERROR(INDEX($C$5:$C$44,SMALL(IF((LEN($C$5:$C$44)<>0)*($D$5:$D$44=\"High\")*($E$5:$E$44=\"High\"),ROW($C$5:$C$44)-ROW($C$4),\"\"),ROW(D8)-ROW($C$4))),\"\")","v":""},null,"✗",{"$f":"IFERROR(INDEX($C$5:$C$44,SMALL(IF((LEN($C$5:$C$44)<>0)*($D$5:$D$44=\"Low\")*($E$5:$E$44=\"High\"),ROW($C$5:$C$44)-ROW($C$4),\"\"),ROW(C8)-ROW($C$4))),\"\")","v":"Create Sustainability KPI Framework"}]
[null,null,"Train Field Officers on RAI Principles / CP Standards","Low","High",null,null,{"$f":"IFERROR(INDEX($C$5:$C$44,SMALL(IF((LEN($C$5:$C$44)<>0)*($D$5:$D$44=\"High\")*($E$5:$E$44=\"High\"),ROW($C$5:$C$44)-ROW($C$4),\"\"),ROW(D9)-ROW($C$4))),\"\")","v":""},null,null,{"$f":"IFERROR(INDEX($C$5:$C$44,SMALL(IF((LEN($C$5:$C$44)<>0)*($D$5:$D$44=\"Low\")*($E$5:$E$44=\"High\"),ROW($C$5:$C$44)-ROW($C$4),\"\"),ROW(C9)-ROW($C$4))),\"\")","v":""}]
[null,null,"Create Farmer Feedback System","Low","High",null,null,{"$f":"IFERROR(INDEX($C$5:$C$44,SMALL(IF((LEN($C$5:$C$44)<>0)*($D$5:$D$44=\"High\")*($E$5:$E$44=\"High\"),ROW($C$5:$C$44)-ROW($C$4),\"\"),ROW(D10)-ROW($C$4))),\"\")","v":""},null,null,{"$f":"IFERROR(INDEX($C$5:$C$44,SMALL(IF((LEN($C$5:$C$44)<>0)*($D$5:$D$44=\"Low\")*($E$5:$E$44=\"High\"),ROW($C$5:$C$44)-ROW($C$4),\"\"),ROW(C10)-ROW($C$4))),\"\")","v":""}]
[null,null,"Revise Supplier Contract Templates","Medium","Medium",null,null,{"$f":"IFERROR(INDEX($C$5:$C$44,SMALL(IF((LEN($C$5:$C$44)<>0)*($D$5:$D$44=\"High\")*($E$5:$E$44=\"High\"),ROW($C$5:$C$44)-ROW($C$4),\"\"),ROW(D11)-ROW($C$4))),\"\")","v":""},null,null,{"$f":"IFERROR(INDEX($C$5:$C$44,SMALL(IF((LEN($C$5:$C$44)<>0)*($D$5:$D$44=\"Low\")*($E$5:$E$44=\"High\"),ROW($C$5:$C$44)-ROW($C$4),\"\"),ROW(C11)-ROW($C$4))),\"\")","v":""}]
[null,null,"Introduce Gender-Disaggregated Reporting","Low","Medium",null,null,{"$f":"IFERROR(INDEX($C$5:$C$44,SMALL(IF((LEN($C$5:$C$44)<>0)*($D$5:$D$44=\"High\")*($E$5:$E$44=\"High\"),ROW($C$5:$C$44)-ROW($C$4),\"\"),ROW(D12)-ROW($C$4))),\"\")","v":""},null,null,{"$f":"IFERROR(INDEX($C$5:$C$44,SMALL(IF((LEN($C$5:$C$44)<>0)*($D$5:$D$44=\"Low\")*($E$5:$E$44=\"High\"),ROW($C$5:$C$44)-ROW($C$4),\"\"),ROW(C12)-ROW($C$4))),\"\")","v":""}]
[null,null,"Implement Product Traceability System","High","High",null,null,{"$f":"IFERROR(INDEX($C$5:$C$44,SMALL(IF((LEN($C$5:$C$44)<>0)*($D$5:$D$44=\"High\")*($E$5:$E$44=\"High\"),ROW($C$5:$C$44)-ROW($C$4),\"\"),ROW(D13)-ROW($C$4))),\"\")","v":""},null,null,{"$f":"IFERROR(INDEX($C$5:$C$44,SMALL(IF((LEN($C$5:$C$44)<>0)*($D$5:$D$44=\"Low\")*($E$5:$E$44=\"High\"),ROW($C$5:$C$44)-ROW($C$4),\"\"),ROW(C13)-ROW($C$4))),\"\")","v":""}]
[null,null,"Develop Community Engagement Policy","Medium","High",null,null,{"$f":"IFERROR(INDEX($C$5:$C$44,SMALL(IF((LEN($C$5:$C$44)<>0)*($D$5:$D$44=\"High\")*($E$5:$E$44=\"High\"),ROW($C$5:$C$44)-ROW($C$4),\"\"),ROW(D14)-ROW($C$4))),\"\")","v":""},null,null,{"$f":"IFERROR(INDEX($C$5:$C$44,SMALL(IF((LEN($C$5:$C$44)<>0)*($D$5:$D$44=\"Low\")*($E$5:$E$44=\"High\"),ROW($C$5:$C$44)-ROW($C$4),\"\"),ROW(C14)-ROW($C$4))),\"\")","v":""}]
[null,null,"Establish Biodiversity Monitoring System","High","Medium",null,null,{"$f":"IFERROR(INDEX($C$5:$C$44,SMALL(IF((LEN($C$5:$C$44)<>0)*($D$5:$D$44=\"High\")*($E$5:$E$44=\"High\"),ROW($C$5:$C$44)-ROW($C$4),\"\"),ROW(D15)-ROW($C$4))),\"\")","v":""},null,null,{"$f":"IFERROR(INDEX($C$5:$C$44,SMALL(IF((LEN($C$5:$C$44)<>0)*($D$5:$D$44=\"Low\")*($E$5:$E$44=\"High\"),ROW($C$5:$C$44)-ROW($C$4),\"\"),ROW(C15)-ROW($C$4))),\"\")","v":""}]
[null,null,"Create Sustainability KPI Framework","Low","High",null,null,{"$f":"IFERROR(INDEX($C$5:$C$44,SMALL(IF((LEN($C$5:$C$44)<>0)*($D$5:$D$44=\"High\")*($E$5:$E$44=\"High\"),ROW($C$5:$C$44)-ROW($C$4),\"\"),ROW(D15)-ROW($C$4))),\"\")","v":""},null,null,{"$f":"IFERROR(INDEX($C$5:$C$44,SMALL(IF((LEN($C$5:$C$44)<>0)*($D$5:$D$44=\"Low\")*($E$5:$E$44=\"High\"),ROW($C$5:$C$44)-ROW($C$4),\"\"),ROW(C15)-ROW($C$4))),\"\")","v":""}]
[null,null,"Create a client complaints phone line to replace your branch suggestion boxes.","High","Low",null,"Thankless Tasks (High Effort + Low Impact)",null,null,"Fill Ins (Low Effort + Low Impact)"]
[{"$nulls":6},"✗",{"$f":"IFERROR(INDEX($C$5:$C$44,SMALL(IF((LEN($C$5:$C$44)<>0)*($D$5:$D$44=\"High\")*($E$5:$E$44=\"Low\"),ROW($C$5:$C$44)-ROW($C$4),\"\"),ROW(C5)-ROW($C$4))),\"\")","v":"Create a client complaints phone line to replace your branch suggestion boxes."},null,null,{"$f":"IFERROR(INDEX($C$5:$C$44,SMALL(IF((LEN($C$5:$C$44)<>0)*($D$5:$D$44=\"Low\")*($E$5:$E$44=\"Low\"),ROW($C$5:$C$44)-ROW($C$4),\"\"),ROW(C5)-ROW($C$4))),\"\")","v":""}]
[{"$nulls":7},{"$f":"IFERROR(INDEX($C$5:$C$44,SMALL(IF((LEN($C$5:$C$44)<>0)*($D$5:$D$44=\"High\")*($E$5:$E$44=\"Low\"),ROW($C$5:$C$44)-ROW($C$4),\"\"),ROW(C6)-ROW($C$4))),\"\")","v":""},null,null,{"$f":"IFERROR(INDEX($C$5:$C$44,SMALL(IF((LEN($C$5:$C$44)<>0)*($D$5:$D$44=\"Low\")*($E$5:$E$44=\"Low\"),ROW($C$5:$C$44)-ROW($C$4),\"\"),ROW(C6)-ROW($C$4))),\"\")","v":""}]
[{"$nulls":7},{"$f":"IFERROR(INDEX($C$5:$C$44,SMALL(IF((LEN($C$5:$C$44)<>0)*($D$5:$D$44=\"High\")*($E$5:$E$44=\"Low\"),ROW($C$5:$C$44)-ROW($C$4),\"\"),ROW(C7)-ROW($C$4))),\"\")","v":""},null,null,{"$f":"IFERROR(INDEX($C$5:$C$44,SMALL(IF((LEN($C$5:$C$44)<>0)*($D$5:$D$44=\"Low\")*($E$5:$E$44=\"Low\"),ROW($C$5:$C$44)-ROW($C$4),\"\"),ROW(C7)-ROW($C$4))),\"\")","v":""}]
[{"$nulls":7},{"$f":"IFERROR(INDEX($C$5:$C$44,SMALL(IF((LEN($C$5:$C$44)<>0)*($D$5:$D$44=\"High\")*($E$5:$E$44=\"Low\"),ROW($C$5:$C$44)-ROW($C$4),\"\"),ROW(C8)-ROW($C$4))),\"\")","v":""},null,null,{"$f":"IFERROR(INDEX($C$5:$C$44,SMALL(IF((LEN($C$5:$C$44)<>0)*($D$5:$D$44=\"Low\")*($E$5:$E$44=\"Low\"),ROW($C$5:$C$44)-ROW($C$4),\"\"),ROW(C8)-ROW($C$4))),\"\")","v":""}]
[{"$nulls":7},{"$f":"IFERROR(INDEX($C$5:$C$44,SMALL(IF((LEN($C$5:$C$44)<>0)*($D$5:$D$44=\"High\")*($E$5:$E$44=\"Low\"),ROW($C$5:$C$44)-ROW($C$4),\"\"),ROW(C9)-ROW($C$4))),\"\")","v":""},null,null,{"$f":"IFERROR(INDEX($C$5:$C$44,SMALL(IF((LEN($C$5:$C$44)<>0)*($D$5:$D$44=\"Low\")*($E$5:$E$44=\"Low\"),ROW($C$5:$C$44)-ROW($C$4),\"\"),ROW(C9)-ROW($C$4))),\"\")","v":""}]
[{"$nulls":7},{"$f":"IFERROR(INDEX($C$5:$C$44,SMALL(IF((LEN($C$5:$C$44)<>0)*($D$5:$D$44=\"High\")*($E$5:$E$44=\"Low\"),ROW($C$5:$C$44)-ROW($C$4),\"\"),ROW(C10)-ROW($C$4))),\"\")","v":""},null,null,{"$f":"IFERROR(INDEX($C$5:$C$44,SMALL(IF((LEN($C$5:$C$44)<>0)*($D$5:$D$44=\"Low\")*($E$5:$E$44=\"Low\"),ROW($C$5:$C$44)-ROW($C$4),\"\"),ROW(C10)-ROW($C$4))),\"\")","v":""}]
[{"$nulls":7},{"$f":"IFERROR(INDEX($C$5:$C$44,SMALL(IF((LEN($C$5:$C$44)<>0)*($D$5:$D$44=\"High\")*($E$5:$E$44=\"Low\"),ROW($C$5:$C$44)-ROW($C$4),\"\"),ROW(C11)-ROW($C$4))),\"\")","v":""},null,null,{"$f":"IFERROR(INDEX($C$5:$C$44,SMALL(IF((LEN($C$5:$C$44)<>0)*($D$5:$D$44=\"Low\")*($E$5:$E$44=\"Low\"),ROW($C$5:$C$44)-ROW($C$4),\"\"),ROW(C11)-ROW($C$4))),\"\")","v":""}]
[{"$nulls":7},{"$f":"IFERROR(INDEX($C$5:$C$44,SMALL(IF((LEN($C$5:$C$44)<>0)*($D$5:$D$44=\"High\")*($E$5:$E$44=\"Low\"),ROW($C$5:$C$44)-ROW($C$4),\"\"),ROW(C12)-ROW($C$4))),\"\")","v":""},null,null,{"$f":"IFERROR(INDEX($C$5:$C$44,SMALL(IF((LEN($C$5:$C$44)<>0)*($D$5:$D$44=\"Low\")*($E$5:$E$44=\"Low\"),ROW($C$5:$C$44)-ROW($C$4),\"\"),ROW(C12)-ROW($C$4))),\"\")","v":""}]
[{"$nulls":7},{"$f":"IFERROR(INDEX($C$5:$C$44,SMALL(IF((LEN($C$5:$C$44)<>0)*($D$5:$D$44=\"High\")*($E$5:$E$44=\"Low\"),ROW($C$5:$C$44)-ROW($C$4),\"\"),ROW(C13)-ROW($C$4))),\"\")","v":""},null,null,{"$f":"IFERROR(INDEX($C$5:$C$44,SMALL(IF((LEN($C$5:$C$44)<>0)*($D$5:$D$44=\"Low\")*($E$5:$E$44=\"Low\"),ROW($C$5:$C$44)-ROW($C$4),\"\"),ROW(C13)-ROW($C$4))),\"\")","v":""}]
[{"$nulls":7},{"$f":"IFERROR(INDEX($C$5:$C$44,SMALL(IF((LEN($C$5:$C$44)<>0)*($D$5:$D$44=\"High\")*($E$5:$E$44=\"Low\"),ROW($C$5:$C$44)-ROW($C$4),\"\"),ROW(C14)-ROW($C$4))),\"\")","v":""},null,null,{"$f":"IFERROR(INDEX($C$5:$C$44,SMALL(IF((LEN($C$5:$C$44)<>0)*($D$5:$D$44=\"Low\")*($E$5:$E$44=\"Low\"),ROW($C$5:$C$44)-ROW($C$4),\"\"),ROW(C14)-ROW($C$4))),\"\")","v":""}]
[{"$nulls":7},{"$f":"IFERROR(INDEX($C$5:$C$44,SMALL(IF((LEN($C$5:$C$44)<>0)*($D$5:$D$44=\"High\")*($E$5:$E$44=\"Low\"),ROW($C$5:$C$44)-ROW($C$4),\"\"),ROW(C15)-ROW($C$4))),\"\")","v":""},null,null,{"$f":"IFERROR(INDEX($C$5:$C$44,SMALL(IF((LEN($C$5:$C$44)<>0)*($D$5:$D$44=\"Low\")*($E$5:$E$44=\"Low\"),ROW($C$5:$C$44)-ROW($C$4),\"\"),ROW(C15)-ROW($C$4))),\"\")","v":""}]

{"sheet":"Priorities Matrix","index":2,"n_rows":39,"n_cols":13,"rows_kept":39,"cut":false,"hidden":false,"merged":[[1,5,1,10],[1,1,1,3],[1,12,2,12]]}
[{"$nulls":12},"About the tool"]
[null,"From the Impact/Effort analysis ",null,null,null,"Factors to be considered when prioritizing gaps and developing an action plan to improve practices",{"$nulls":6},"Back"]
[]
[null,"Tasks","Effort","Impact",null,"Minimum Agri CP/RAI requirements","Strategy","Risk management","Context","Related Gaps ","Time and resources"]
[null,{"$f":"VLOOKUP('Impact Effort Matrix'!C5,'Impact Effort Matrix'!C5,1,FALSE)","v":"Develop Sustainability Dashboard"},{"$f":"IFERROR((VLOOKUP('Impact Effort Matrix'!D5,'Impact Effort Matrix'!D5,1,FALSE)),\"\")","v":"High"},{"$f":"IFERROR(VLOOKUP('Impact Effort Matrix'!E5,'Impact Effort Matrix'!E5,1,FALSE),\"\")","v":"High"},null,"High","High","Low","Low","No","No"]
[null,{"$f":"VLOOKUP('Impact Effort Matrix'!C6,'Impact Effort Matrix'!C6,1,FALSE)","v":"Establish Stakeholder Grievance Mechanism"},{"$f":"IFERROR((VLOOKUP('Impact Effort Matrix'!D6,'Impact Effort Matrix'!D6,1,FALSE)),\"\")","v":"Low"},{"$f":"IFERROR(VLOOKUP('Impact Effort Matrix'!E6,'Impact Effort Matrix'!E6,1,FALSE),\"\")","v":"High"},null,"Low","Low","Medium","High","Yes","Yes"]
[null,{"$f":"VLOOKUP('Impact Effort Matrix'!C7,'Impact Effort Matrix'!C7,1,FALSE)","v":"Conduct Climate Risk Assessment"},{"$f":"IFERROR((VLOOKUP('Impact Effort Matrix'!D7,'Impact Effort Matrix'!D7,1,FALSE)),\"\")","v":"Medium"},{"$f":"IFERROR(VLOOKUP('Impact Effort Matrix'!E7,'Impact Effort Matrix'!E7,1,FALSE),\"\")","v":"High"},null,"Medium","High","Low","Low","Yes","Yes"]
[null,{"$f":"VLOOKUP('Impact Effort Matrix'!C8,'Impact Effort Matrix'!C8,1,FALSE)","v":"Develop Environmental Management Plan"},{"$f":"IFERROR((VLOOKUP('Impact Effort Matrix'!D8,'Impact Effort Matrix'!D8,1,FALSE)),\"\")","v":"High"},{"$f":"IFERROR(VLOOKUP('Impact Effort Matrix'!E8,'Impact Effort Matrix'!E8,1,FALSE),\"\")","v":"High"},null,"Medium","High","High","High","Yes","No"]
[null,{"$f":"VLOOKUP('Impact Effort Matrix'!C9,'Impact Effort Matrix'!C9,1,FALSE)","v":"Train Field Officers on RAI Principles / CP Standards"},{"$f":"IFERROR((VLOOKUP('Impact Effort Matrix'!D9,'Impact Effort Matrix'!D9,1,FALSE)),\"\")","v":"Low"},{"$f":"IFERROR(VLOOKUP('Impact Effort Matrix'!E9,'Impact Effort Matrix'!E9,1,FALSE),\"\")","v":"High"}]
[null,{"$f":"VLOOKUP('Impact Effort Matrix'!C10,'Impact Effort Matrix'!C10,1,FALSE)","v":"Create Farmer Feedback System"},{"$f":"IFERROR((VLOOKUP('Impact Effort Matrix'!D10,'Impact Effort Matrix'!D10,1,FALSE)),\"\")","v":"Low"},{"$f":"IFERROR(VLOOKUP('Impact Effort Matrix'!E10,'Impact Effort Matrix'!E10,1,FALSE),\"\")","v":"High"}]
[null,{"$f":"VLOOKUP('Impact Effort Matrix'!C11,'Impact Effort Matrix'!C11,1,FALSE)","v":"Revise Supplier Contract Templates"},{"$f":"IFERROR((VLOOKUP('Impact Effort Matrix'!D11,'Impact Effort Matrix'!D11,1,FALSE)),\"\")","v":"Medium"},{"$f":"IFERROR(VLOOKUP('Impact Effort Matrix'!E11,'Impact Effort Matrix'!E11,1,FALSE),\"\")","v":"Medium"}]
[null,{"$f":"VLOOKUP('Impact Effort Matrix'!C12,'Impact Effort Matrix'!C12,1,FALSE)","v":"Introduce Gender-Disaggregated Reporting"},{"$f":"IFERROR((VLOOKUP('Impact Effort Matrix'!D12,'Impact Effort Matrix'!D12,1,FALSE)),\"\")","v":"Low"},{"$f":"IFERROR(VLOOKUP('Impact Effort Matrix'!E12,'Impact Effort Matrix'!E12,1,FALSE),\"\")","v":"Medium"}]
[null,{"$f":"VLOOKUP('Impact Effort Matrix'!C13,'Impact Effort Matrix'!C13,1,FALSE)","v":"Implement Product Traceability System"},{"$f":"IFERROR((VLOOKUP('Impact Effort Matrix'!D13,'Impact Effort Matrix'!D13,1,FALSE)),\"\")","v":"High"},{"$f":"IFERROR(VLOOKUP('Impact Effort Matrix'!E13,'Impact Effort Matrix'!E13,1,FALSE),\"\")","v":"High"}]
[null,{"$f":"VLOOKUP('Impact Effort Matrix'!C14,'Impact Effort Matrix'!C14,1,FALSE)","v":"Develop Community Engagement Policy"},{"$f":"IFERROR((VLOOKUP('Impact Effort Matrix'!D14,'Impact Effort Matrix'!D14,1,FALSE)),\"\")","v":"Medium"},{"$f":"IFERROR(VLOOKUP('Impact Effort Matrix'!E14,'Impact Effort Matrix'!E14,1,FALSE),\"\")","v":"High"}]
[null,{"$f":"VLOOKUP('Impact Effort Matrix'!C15,'Impact Effort Matrix'!C15,1,FALSE)","v":"Establish Biodiversity Monitoring System"},{"$f":"IFERROR((VLOOKUP('Impact Effort Matrix'!D15,'Impact Effort Matrix'!D15,1,FALSE)),\"\")","v":"High"},{"$f":"IFERROR(VLOOKUP('Impact Effort Matrix'!E15,'Impact Effort Matrix'!E15,1,FALSE),\"\")","v":"Medium"}]
[null,{"$f":"VLOOKUP('Impact Effort Matrix'!C16,'Impact Effort Matrix'!C16,1,FALSE)","v":"Create Sustainability KPI Framework"},{"$f":"IFERROR((VLOOKUP('Impact Effort Matrix'!D16,'Impact Effort Matrix'!D16,1,FALSE)),\"\")","v":"Low"},{"$f":"IFERROR(VLOOKUP('Impact Effort Matrix'!E16,'Impact Effort Matrix'!E16,1,FALSE),\"\")","v":"High"}]
[null,{"$f":"VLOOKUP('Impact Effort Matrix'!C17,'Impact Effort Matrix'!C17,1,FALSE)","v":"Create a client complaints phone line to replace your branch suggestion boxes."},{"$f":"IFERROR((VLOOKUP('Impact Effort Matrix'!D17,'Impact Effort Matrix'!D17,1,FALSE)),\"\")","v":"High"},{"$f":"IFERROR(VLOOKUP('Impact Effort Matrix'!E17,'Impact Effort Matrix'!E17,1,FALSE),\"\")","v":"Low"}]
[null,{"$f":"VLOOKUP('Impact Effort Matrix'!C18,'Impact Effort Matrix'!C18,1,FALSE)","v":{"$error":"#N/A"}},{"$f":"IFERROR((VLOOKUP('Impact Effort Matrix'!D18,'Impact Effort Matrix'!D18,1,FALSE)),\"\")","v":""},{"$f":"IFERROR(VLOOKUP('Impact Effort Matrix'!E18,'Impact Effort Matrix'!E18,1,FALSE),\"\")","v":""}]
[null,{"$f":"VLOOKUP('Impact Effort Matrix'!C19,'Impact Effort Matrix'!C19,1,FALSE)","v":{"$error":"#N/A"}},{"$f":"IFERROR((VLOOKUP('Impact Effort Matrix'!D19,'Impact Effort Matrix'!D19,1,FALSE)),\"\")","v":""},{"$f":"IFERROR(VLOOKUP('Impact Effort Matrix'!E19,'Impact Effort Matrix'!E19,1,FALSE),\"\")","v":""}]
[null,{"$f":"VLOOKUP('Impact Effort Matrix'!C20,'Impact Effort Matrix'!C20,1,FALSE)","v":{"$error":"#N/A"}},{"$f":"IFERROR((VLOOKUP('Impact Effort Matrix'!D20,'Impact Effort Matrix'!D20,1,FALSE)),\"\")","v":""},{"$f":"IFERROR(VLOOKUP('Impact Effort Matrix'!E20,'Impact Effort Matrix'!E20,1,FALSE),\"\")","v":""}]
[null,{"$f":"VLOOKUP('Impact Effort Matrix'!C21,'Impact Effort Matrix'!C21,1,FALSE)","v":{"$error":"#N/A"}},{"$f":"IFERROR((VLOOKUP('Impact Effort Matrix'!D21,'Impact Effort Matrix'!D21,1,FALSE)),\"\")","v":""},{"$f":"IFERROR(VLOOKUP('Impact Effort Matrix'!E21,'Impact Effort Matrix'!E21,1,FALSE),\"\")","v":""}]
[null,{"$f":"VLOOKUP('Impact Effort Matrix'!C22,'Impact Effort Matrix'!C22,1,FALSE)","v":{"$error":"#N/A"}},{"$f":"IFERROR((VLOOKUP('Impact Effort Matrix'!D22,'Impact Effort Matrix'!D22,1,FALSE)),\"\")","v":""},{"$f":"IFERROR(VLOOKUP('Impact Effort Matrix'!E22,'Impact Effort Matrix'!E22,1,FALSE),\"\")","v":""}]
[null,{"$f":"VLOOKUP('Impact Effort Matrix'!C23,'Impact Effort Matrix'!C23,1,FALSE)","v":{"$error":"#N/A"}},{"$f":"IFERROR((VLOOKUP('Impact Effort Matrix'!D23,'Impact Effort Matrix'!D23,1,FALSE)),\"\")","v":""},{"$f":"IFERROR(VLOOKUP('Impact Effort Matrix'!E23,'Impact Effort Matrix'!E23,1,FALSE),\"\")","v":""}]
[null,{"$f":"VLOOKUP('Impact Effort Matrix'!C24,'Impact Effort Matrix'!C24,1,FALSE)","v":{"$error":"#N/A"}},{"$f":"IFERROR((VLOOKUP('Impact Effort Matrix'!D24,'Impact Effort Matrix'!D24,1,FALSE)),\"\")","v":""},{"$f":"IFERROR(VLOOKUP('Impact Effort Matrix'!E24,'Impact Effort Matrix'!E24,1,FALSE),\"\")","v":""}]
[null,{"$f":"VLOOKUP('Impact Effort Matrix'!C25,'Impact Effort Matrix'!C25,1,FALSE)","v":{"$error":"#N/A"}},{"$f":"IFERROR((VLOOKUP('Impact Effort Matrix'!D25,'Impact Effort Matrix'!D25,1,FALSE)),\"\")","v":""},{"$f":"IFERROR(VLOOKUP('Impact Effort Matrix'!E25,'Impact Effort Matrix'!E25,1,FALSE),\"\")","v":""}]
[null,{"$f":"VLOOKUP('Impact Effort Matrix'!C26,'Impact Effort Matrix'!C26,1,FALSE)","v":{"$error":"#N/A"}},{"$f":"IFERROR((VLOOKUP('Impact Effort Matrix'!D26,'Impact Effort Matrix'!D26,1,FALSE)),\"\")","v":""},{"$f":"IFERROR(VLOOKUP('Impact Effort Matrix'!E26,'Impact Effort Matrix'!E26,1,FALSE),\"\")","v":""}]
[null,{"$f":"VLOOKUP('Impact Effort Matrix'!C27,'Impact Effort Matrix'!C27,1,FALSE)","v":{"$error":"#N/A"}},{"$f":"IFERROR((VLOOKUP('Impact Effort Matrix'!D27,'Impact Effort Matrix'!D27,1,FALSE)),\"\")","v":""},{"$f":"IFERROR(VLOOKUP('Impact Effort Matrix'!E27,'Impact Effort Matrix'!E27,1,FALSE),\"\")","v":""}]
[null,{"$f":"VLOOKUP('Impact Effort Matrix'!C28,'Impact Effort Matrix'!C28,1,FALSE)","v":{"$error":"#N/A"}},{"$f":"IFERROR((VLOOKUP('Impact Effort Matrix'!D28,'Impact Effort Matrix'!D28,1,FALSE)),\"\")","v":""},{"$f":"IFERROR(VLOOKUP('Impact Effort Matrix'!E28,'Impact Effort Matrix'!E28,1,FALSE),\"\")","v":""}]
[null,{"$f":"VLOOKUP('Impact Effort Matrix'!C29,'Impact Effort Matrix'!C29,1,FALSE)","v":{"$error":"#N/A"}},{"$f":"IFERROR((VLOOKUP('Impact Effort Matrix'!D29,'Impact Effort Matrix'!D29,1,FALSE)),\"\")","v":""},{"$f":"IFERROR(VLOOKUP('Impact Effort Matrix'!E29,'Impact Effort Matrix'!E29,1,FALSE),\"\")","v":""}]
[null,{"$f":"VLOOKUP('Impact Effort Matrix'!C30,'Impact Effort Matrix'!C30,1,FALSE)","v":{"$error":"#N/A"}},{"$f":"IFERROR((VLOOKUP('Impact Effort Matrix'!D30,'Impact Effort Matrix'!D30,1,FALSE)),\"\")","v":""},{"$f":"IFERROR(VLOOKUP('Impact Effort Matrix'!E30,'Impact Effort Matrix'!E30,1,FALSE),\"\")","v":""}]
{"$rows_left_out":10}
{"sheet":"Challenges ","index":3,"n_rows":17,"n_cols":11,"rows_kept":17,"cut":false,"hidden":false,"merged":[[1,1,1,5],[1,8,2,8],[3,1,3,5]]}
[]
[null,"Challenges Matrix ",{"$nulls":5},"About the tool'!A1","Back"]
[]
[null,"This section is the Challenges Matrix, used to document implementation barriers that may affect the execution of RAF/RAI recommendations."]
[null,"Challenge ","Why?","To do ","Status ","Reflected on the action plan? "]
[null,"Basic introductory training on RAI principles / Agri CP Standards for the Board","Two Board members are unavailable for in-person training until the next Board meeting cycle","Organize an online RAI / Agri CP awareness session and provide self-learning materials to Board members","Planned","✓"]
[null,"Establish a stakeholder grievance mechanism accessible to farmers, suppliers, workers, and communities","Limited budget and insufficient human resources to operate a dedicated grievance hotline","Maintain existing complaint channels (suggestion boxes, local focal points, community meetings) while progressively developing a formal grievance mechanism","Delayed","✗"]
[]
[{"$nulls":9},"Status","Meaning"]
[{"$nulls":9},"Not Started","No action has been initiated yet"]
[{"$nulls":9},"Planned","Action has been approved and scheduled"]
[{"$nulls":9},"In Progress","Implementation has started"]
[{"$nulls":9},"Partially Completed","Some activities completed, others still pending"]
[{"$nulls":9},"Completed","Action fully implemented"]
[{"$nulls":9},"On Hold","Temporarily suspended"]
[{"$nulls":9},"Delayed","Implementation behind schedule"]
[{"$nulls":9},"Cancelled","Action will not be implemented"]